BDBM76918 2-[[5-[(1-methylpyrrol-2-yl)methyl]-4-(p-tolyl)-1,2,4-triazol-3-yl]thio]-N-piperonyl-acetamide::MLS000092948::N-(1,3-benzodioxol-5-ylmethyl)-2-({4-(4-methylphenyl)-5-[(1-methyl-1H-pyrrol-2-yl)methyl]-4H-1,2,4-triazol-3-yl}thio)acetamide::N-(1,3-benzodioxol-5-ylmethyl)-2-[[4-(4-methylphenyl)-5-[(1-methyl-2-pyrrolyl)methyl]-1,2,4-triazol-3-yl]thio]acetamide::N-(1,3-benzodioxol-5-ylmethyl)-2-[[4-(4-methylphenyl)-5-[(1-methylpyrrol-2-yl)methyl]-1,2,4-triazol-3-yl]sulfanyl]acetamide::N-(1,3-benzodioxol-5-ylmethyl)-2-[[4-(4-methylphenyl)-5-[(1-methylpyrrol-2-yl)methyl]-1,2,4-triazol-3-yl]sulfanyl]ethanamide::SMR000028584::cid_3236243
SMILES Cc1ccc(cc1)-n1c(Cc2cccn2C)nnc1SCC(=O)NCc1ccc2OCOc2c1
InChI Key InChIKey=FWZWETFMJIATPW-UHFFFAOYSA-N
Data  1 EC50
  Tab Delimited (TSV)   2D SDfile   Computed 3D by Vconf -m prep SDfile
Find this compound or compounds like it in BindingDB:
Activity Spreadsheet -- Enzyme Inhibition Constant Data from BindingDB
Found 1 hit for monomerid = 76918
TargetVoltage-dependent T-type calcium channel subunit alpha-1H(Homo sapiens (Human))
Vanderbilt Screening Center For Gpcrs, Ion Channels And Transporters
Curated by PubChem BioAssay
LigandPNGBDBM76918(2-[[5-[(1-methylpyrrol-2-yl)methyl]-4-(p-tolyl)-1,...)
Affinity DataEC50:  1.31E+3nM. Assay description: Assay Provider: Xinmin Xie Assay Provider Affiliation: Bioscience Division, SRI International, Menlo Park, CA Grant Title: HTS Assay for Cav3 T-Type ...
In DepthDetails PCBioAssay