BDBM77056 3-(3-chloro-4-fluoro-anilino)-2-(2-furfuryl)isoindolin-1-one::3-(3-chloro-4-fluoroanilino)-2-(2-furanylmethyl)-3H-isoindol-1-one::3-(3-chloro-4-fluoroanilino)-2-(furan-2-ylmethyl)-3H-isoindol-1-one::3-[(3-chloranyl-4-fluoranyl-phenyl)amino]-2-(furan-2-ylmethyl)-3H-isoindol-1-one::MLS000116917::SMR000093871::cid_5309552
SMILES Fc1ccc(NC2N(Cc3ccco3)C(=O)c3ccccc23)cc1Cl
InChI Key InChIKey=BYCCRRYFVLGIEA-UHFFFAOYSA-N
Data  1 EC50
  Tab Delimited (TSV)   2D SDfile   Computed 3D by Vconf -m prep SDfile
Find this compound or compounds like it in BindingDB:
Activity Spreadsheet -- Enzyme Inhibition Constant Data from BindingDB
Found 1 hit for monomerid = 77056
TargetVoltage-dependent T-type calcium channel subunit alpha-1H(Homo sapiens (Human))
Vanderbilt Screening Center For Gpcrs, Ion Channels And Transporters
Curated by PubChem BioAssay
LigandPNGBDBM77056(3-(3-chloro-4-fluoro-anilino)-2-(2-furfuryl)isoind...)
Affinity DataEC50:  3.88E+3nM. Assay description: Assay Provider: Xinmin Xie Assay Provider Affiliation: Bioscience Division, SRI International, Menlo Park, CA Grant Title: HTS Assay for Cav3 T-Type ...
In DepthDetails PCBioAssay