BDBM77153 4-[(1-tert-Butyl-1H-tetrazol-5-yl)-(4-chloro-phenyl)-methyl]-thiomorpholine::4-[(1-tert-butyl-1,2,3,4-tetrazol-5-yl)-(4-chlorophenyl)methyl]thiomorpholine::4-[(1-tert-butyl-5-tetrazolyl)-(4-chlorophenyl)methyl]thiomorpholine::4-[(1-tert-butyltetrazol-5-yl)-(4-chlorophenyl)methyl]thiomorpholine::MLS000528119::SMR000120693::cid_3193513
SMILES CC(C)(C)n1nnnc1C(N1CCSCC1)c1ccc(Cl)cc1
InChI Key InChIKey=LLWDGPDTIRQTTN-UHFFFAOYSA-N
Data  1 EC50
  Tab Delimited (TSV)   2D SDfile   Computed 3D by Vconf -m prep SDfile
Find this compound or compounds like it in BindingDB:
Activity Spreadsheet -- Enzyme Inhibition Constant Data from BindingDB
Found 1 hit for monomerid = 77153
TargetVoltage-dependent T-type calcium channel subunit alpha-1H(Homo sapiens (Human))
Vanderbilt Screening Center For Gpcrs, Ion Channels And Transporters
Curated by PubChem BioAssay
LigandPNGBDBM77153(4-[(1-tert-Butyl-1H-tetrazol-5-yl)-(4-chloro-pheny...)
Affinity DataEC50:  850nM. Assay description: Assay Provider: Xinmin Xie Assay Provider Affiliation: Bioscience Division, SRI International, Menlo Park, CA Grant Title: HTS Assay for Cav3 T-Type ...
In DepthDetails PCBioAssay