BDBM77249 MLS000537424::N-(2-furanylmethyl)-3-(4-methylphenyl)-3-(4-propan-2-yloxyphenyl)propanamide::N-(2-furfuryl)-3-(4-isopropoxyphenyl)-3-(p-tolyl)propionamide::N-(2-furylmethyl)-3-(4-isopropoxyphenyl)-3-(4-methylphenyl)propanamide::N-(furan-2-ylmethyl)-3-(4-methylphenyl)-3-(4-propan-2-yloxyphenyl)propanamide::SMR000143862::cid_2956343
SMILES CC(C)Oc1ccc(cc1)C(CC(=O)NCc1ccco1)c1ccc(C)cc1
InChI Key InChIKey=JURVIZJDXIEMTH-UHFFFAOYSA-N
Data  1 EC50
  Tab Delimited (TSV)   2D SDfile   Computed 3D by Vconf -m prep SDfile
Find this compound or compounds like it in BindingDB:
Activity Spreadsheet -- Enzyme Inhibition Constant Data from BindingDB
Found 1 hit for monomerid = 77249
TargetVoltage-dependent T-type calcium channel subunit alpha-1H(Homo sapiens (Human))
Vanderbilt Screening Center For Gpcrs, Ion Channels And Transporters
Curated by PubChem BioAssay
LigandPNGBDBM77249(MLS000537424 | N-(2-furanylmethyl)-3-(4-methylphen...)
Affinity DataEC50:  1.59E+4nM. Assay description: Assay Provider: Xinmin Xie Assay Provider Affiliation: Bioscience Division, SRI International, Menlo Park, CA Grant Title: HTS Assay for Cav3 T-Type ...
In DepthDetails PCBioAssay