BDBM77254 MLS000522453::N-(4-ethylbenzyl)-3-[3-(2-thienyl)-1,2,4-oxadiazol-5-yl]propionamide::N-[(4-ethylphenyl)methyl]-3-(3-thiophen-2-yl-1,2,4-oxadiazol-5-yl)propanamide::SMR000127720::cid_9550880
SMILES CCc1ccc(CNC(=O)CCc2nc(no2)-c2cccs2)cc1
InChI Key InChIKey=BWMNVDHWVWKVGF-UHFFFAOYSA-N
Data  1 EC50
  Tab Delimited (TSV)   2D SDfile   Computed 3D by Vconf -m prep SDfile
Find this compound or compounds like it in BindingDB:
Activity Spreadsheet -- Enzyme Inhibition Constant Data from BindingDB
Found 1 hit for monomerid = 77254
TargetVoltage-dependent T-type calcium channel subunit alpha-1H(Homo sapiens (Human))
Vanderbilt Screening Center For Gpcrs, Ion Channels And Transporters
Curated by PubChem BioAssay
LigandPNGBDBM77254(MLS000522453 | N-(4-ethylbenzyl)-3-[3-(2-thienyl)-...)
Affinity DataEC50:  1.21E+3nM. Assay description: Assay Provider: Xinmin Xie Assay Provider Affiliation: Bioscience Division, SRI International, Menlo Park, CA Grant Title: HTS Assay for Cav3 T-Type ...
In DepthDetails PCBioAssay