BDBM77274 MLS000538021::N-(2-furanylmethyl)-3-phenyl-3-(4-propan-2-yloxyphenyl)propanamide::N-(2-furfuryl)-3-(4-isopropoxyphenyl)-3-phenyl-propionamide::N-(2-furylmethyl)-3-(4-isopropoxyphenyl)-3-phenylpropanamide::N-(furan-2-ylmethyl)-3-phenyl-3-(4-propan-2-yloxyphenyl)propanamide::SMR000144258::cid_2964479
SMILES CC(C)Oc1ccc(cc1)C(CC(=O)NCc1ccco1)c1ccccc1
InChI Key InChIKey=YTBXGOJFBKCNJF-UHFFFAOYSA-N
Data  2 IC50  1 EC50
  Tab Delimited (TSV)   2D SDfile   Computed 3D by Vconf -m prep SDfile
Find this compound or compounds like it in BindingDB:
Activity Spreadsheet -- Enzyme Inhibition Constant Data from BindingDB
Found 3 hits for monomerid = 77274
TargetVoltage-dependent T-type calcium channel subunit alpha-1H(Homo sapiens (Human))
Vanderbilt Screening Center For Gpcrs, Ion Channels And Transporters
Curated by PubChem BioAssay
LigandPNGBDBM77274(MLS000538021 | N-(2-furanylmethyl)-3-phenyl-3-(4-p...)
Affinity DataEC50:  4.77E+3nM. Assay description: Assay Provider: Xinmin Xie Assay Provider Affiliation: Bioscience Division, SRI International, Menlo Park, CA Grant Title: HTS Assay for Cav3 T-Type ...
In DepthDetails PCBioAssay
TargetPhospholipase A2(Homo sapiens (Human))
Burnham Center For Chemical Genomics
Curated by PubChem BioAssay
LigandPNGBDBM77274(MLS000538021 | N-(2-furanylmethyl)-3-phenyl-3-(4-p...)
Affinity DataIC50:  1.16E+4nM. Assay description: Data Source: Sanford-Burnham Center for Chemical Genomics (SBCCG) Source Affiliation: Sanford-Burnham Medical Research Institute (SBMRI, San Diego, C...
In DepthDetails PCBioAssay
TargetCysteine protease ATG4B(Homo sapiens (Human))
Burnham Center For Chemical Genomics
Curated by PubChem BioAssay
LigandPNGBDBM77274(MLS000538021 | N-(2-furanylmethyl)-3-phenyl-3-(4-p...)
Affinity DataIC50:  1.64E+4nM. Assay description: Data Source: Sanford-Burnham Center for Chemical Genomics (SBCCG) Source Affiliation: Sanford-Burnham Medical Research Institute (SBMRI, San Diego, C...
In DepthDetails PCBioAssay