BDBM77297 (1H-Indol-3-ylmethyl)-(1-propyl-1H-benzoimidazol-2-yl)-amine::1H-indol-3-ylmethyl-(1-propylbenzimidazol-2-yl)amine::MLS000556623::N-(1H-indol-3-ylmethyl)-1-propyl-2-benzimidazolamine::N-(1H-indol-3-ylmethyl)-1-propyl-benzimidazol-2-amine::N-(1H-indol-3-ylmethyl)-1-propylbenzimidazol-2-amine::SMR000147940::cid_930921
SMILES CCCn1c(NCc2c[nH]c3ccccc23)nc2ccccc12
InChI Key InChIKey=QMWRNWFYUUQHLO-UHFFFAOYSA-N
Data  1 EC50
  Tab Delimited (TSV)   2D SDfile   Computed 3D by Vconf -m prep SDfile
Find this compound or compounds like it in BindingDB:
Activity Spreadsheet -- Enzyme Inhibition Constant Data from BindingDB
Found 1 hit for monomerid = 77297
TargetVoltage-dependent T-type calcium channel subunit alpha-1H(Homo sapiens (Human))
Vanderbilt Screening Center For Gpcrs, Ion Channels And Transporters
Curated by PubChem BioAssay
LigandPNGBDBM77297((1H-Indol-3-ylmethyl)-(1-propyl-1H-benzoimidazol-2...)
Affinity DataEC50:  5.89E+3nM. Assay description: Assay Provider: Xinmin Xie Assay Provider Affiliation: Bioscience Division, SRI International, Menlo Park, CA Grant Title: HTS Assay for Cav3 T-Type ...
In DepthDetails PCBioAssay