BDBM77327 4-(1H-indol-3-yl)-N-piperonyl-butyramide::MLS000567733::N-(1,3-benzodioxol-5-ylmethyl)-4-(1H-indol-3-yl)butanamide::SMR000154326::cid_4875581
SMILES O=C(CCCc1c[nH]c2ccccc12)NCc1ccc2OCOc2c1
InChI Key InChIKey=TYQLLUAATDLSNH-UHFFFAOYSA-N
Data  1 EC50
  Tab Delimited (TSV)   2D SDfile   Computed 3D by Vconf -m prep SDfile
Find this compound or compounds like it in BindingDB:
Activity Spreadsheet -- Enzyme Inhibition Constant Data from BindingDB
Found 1 hit for monomerid = 77327
TargetVoltage-dependent T-type calcium channel subunit alpha-1H(Homo sapiens (Human))
Vanderbilt Screening Center For Gpcrs, Ion Channels And Transporters
Curated by PubChem BioAssay
LigandPNGBDBM77327(4-(1H-indol-3-yl)-N-piperonyl-butyramide | MLS0005...)
Affinity DataEC50:  2.31E+3nM. Assay description: Assay Provider: Xinmin Xie Assay Provider Affiliation: Bioscience Division, SRI International, Menlo Park, CA Grant Title: HTS Assay for Cav3 T-Type ...
In DepthDetails PCBioAssay