BDBM77364 US9695118, 92
SMILES CCS(=O)(=O)c1ccc(Cl)cc1CNC(=O)c1ccc(CN2CCC[C@@H](C2)NC)c(c1)C(F)(F)F
InChI Key InChIKey=LXOMNORUGYFRRA-FQEVSTJZSA-N
Data  1 IC50
  Tab Delimited (TSV)   2D SDfile   Computed 3D by Vconf -m prep SDfile
Find this compound or compounds like it in BindingDB:
Activity Spreadsheet -- Enzyme Inhibition Constant Data from BindingDB
Found 1 hit for monomerid = 77364
TargetEpithelial discoidin domain-containing receptor 1(Homo sapiens (Human))
Chugai Seiyaku Kabushiki Kaisha
US Patent
LigandPNGBDBM77364(US9695118, 92)
Affinity DataIC50:  12nMT: 2°C. Assay description: DDR1 binding activity was measured by the LanthaScreen (Registered trademark) Eu Kinase Binding Assay (manufactured by Life Technologies Corporation)...
Ligand InfoPC cidPC sid
In DepthDetails US Patent