BDBM77414 4-(benzenesulfonyl)-5-(4-methoxyphenyl)-1-phenylpyrazole::4-besyl-5-(4-methoxyphenyl)-1-phenyl-pyrazole::5-(4-methoxyphenyl)-1-phenyl-1H-pyrazol-4-yl phenyl sulfone::5-(4-methoxyphenyl)-1-phenyl-4-(phenylsulfonyl)pyrazole::MLS000546417::SMR000169587::cid_1483452
SMILES COc1ccc(cc1)-c1c(cnn1-c1ccccc1)S(=O)(=O)c1ccccc1
InChI Key InChIKey=XDBWKMIEQBYKDT-UHFFFAOYSA-N
Data  1 EC50
  Tab Delimited (TSV)   2D SDfile   Computed 3D by Vconf -m prep SDfile
Find this compound or compounds like it in BindingDB:
Activity Spreadsheet -- Enzyme Inhibition Constant Data from BindingDB
Found 1 hit for monomerid = 77414
TargetVoltage-dependent T-type calcium channel subunit alpha-1H(Homo sapiens (Human))
Vanderbilt Screening Center For Gpcrs, Ion Channels And Transporters
Curated by PubChem BioAssay
LigandPNGBDBM77414(4-(benzenesulfonyl)-5-(4-methoxyphenyl)-1-phenylpy...)
Affinity DataEC50:  1.08E+4nM. Assay description: Assay Provider: Xinmin Xie Assay Provider Affiliation: Bioscience Division, SRI International, Menlo Park, CA Grant Title: HTS Assay for Cav3 T-Type ...
In DepthDetails PCBioAssay