BDBM77427 1-(benzenesulfonyl)-5-(1-phenoxyethyl)pyrazole::1-besyl-5-(1-phenoxyethyl)pyrazole::5-(1-phenoxyethyl)-1-(phenylsulfonyl)-1H-pyrazole::5-(1-phenoxyethyl)-1-(phenylsulfonyl)pyrazole::MLS000327899::SMR000168440::cid_3799501
SMILES CC(Oc1ccccc1)c1ccnn1S(=O)(=O)c1ccccc1
InChI Key InChIKey=HYAKUPWZFHYHNE-UHFFFAOYSA-N
Data  1 EC50
  Tab Delimited (TSV)   2D SDfile   Computed 3D by Vconf -m prep SDfile
Find this compound or compounds like it in BindingDB:
Activity Spreadsheet -- Enzyme Inhibition Constant Data from BindingDB
Found 1 hit for monomerid = 77427
TargetVoltage-dependent T-type calcium channel subunit alpha-1H(Homo sapiens (Human))
Vanderbilt Screening Center For Gpcrs, Ion Channels And Transporters
Curated by PubChem BioAssay
LigandPNGBDBM77427(1-(benzenesulfonyl)-5-(1-phenoxyethyl)pyrazole | 1...)
Affinity DataEC50:  5.08E+4nM. Assay description: Assay Provider: Xinmin Xie Assay Provider Affiliation: Bioscience Division, SRI International, Menlo Park, CA Grant Title: HTS Assay for Cav3 T-Type ...
In DepthDetails PCBioAssay