BDBM77461 4-[(4-benzyl-1-piperidinyl)methyl]-N-(2-methylphenyl)benzamide::4-[(4-benzylpiperidin-1-yl)methyl]-N-(2-methylphenyl)benzamide::4-[(4-benzylpiperidino)methyl]-N-(o-tolyl)benzamide::MLS000572512::N-(2-methylphenyl)-4-[[4-(phenylmethyl)-1-piperidinyl]methyl]benzamide::N-(2-methylphenyl)-4-[[4-(phenylmethyl)piperidin-1-yl]methyl]benzamide::SMR000194469::cid_1361560
SMILES Cc1ccccc1NC(=O)c1ccc(CN2CCC(Cc3ccccc3)CC2)cc1
InChI Key InChIKey=JVWWXYXUTLHZCP-UHFFFAOYSA-N
Data  1 EC50
  Tab Delimited (TSV)   2D SDfile   Computed 3D by Vconf -m prep SDfile
Find this compound or compounds like it in BindingDB:
Activity Spreadsheet -- Enzyme Inhibition Constant Data from BindingDB
Found 1 hit for monomerid = 77461
TargetVoltage-dependent T-type calcium channel subunit alpha-1H(Homo sapiens (Human))
Vanderbilt Screening Center For Gpcrs, Ion Channels And Transporters
Curated by PubChem BioAssay
LigandPNGBDBM77461(4-[(4-benzyl-1-piperidinyl)methyl]-N-(2-methylphen...)
Affinity DataEC50:  134nM. Assay description: Assay Provider: Xinmin Xie Assay Provider Affiliation: Bioscience Division, SRI International, Menlo Park, CA Grant Title: HTS Assay for Cav3 T-Type ...
In DepthDetails PCBioAssay