BDBM7747 N-Methyl-4-{[(7-oxo-6,7-dihydro-8H-[1,3]thiazolo[5,4-e]-indol-8-ylidene)methyl]amino}benzenesulfonamide::N-methyl-4-({[(12Z)-11-oxo-3-thia-5,10-diazatricyclo[7.3.0.0^{2,6}]dodeca-1,4,6,8-tetraen-12-ylidene]methyl}amino)benzene-1-sulfonamide::Oxindole-Based Inhibitor 83
SMILES CNS(=O)(=O)c1ccc(cc1)N=CC1C(=O)Nc2ccc3ncsc3c12
InChI Key InChIKey=LCGUWTXINHQLGM-UHFFFAOYSA-N
Data  3 IC50
  Tab Delimited (TSV)   2D SDfile   Computed 3D by Vconf -m prep SDfile
Find this compound or compounds like it in BindingDB:
Activity Spreadsheet -- Enzyme Inhibition Constant Data from BindingDB
Found 3 hits for monomerid = 7747
TargetCyclin-dependent kinase/G2/mitotic-specific cyclin- 1(Homo sapiens (Human))
Glaxosmithkline
LigandPNGBDBM7747(N-Methyl-4-{[(7-oxo-6,7-dihydro-8H-[1,3]thiazolo[5...)
Affinity DataIC50:  64nM. Assay description: The biochemical activity of compounds was determined by incubation with specific enzymes and substrates in the presence 1.4 uM ATP/[gamma-32P] ATP. A...
In DepthDetails ArticlePubMed
TargetCyclin-dependent kinase 2(Homo sapiens (Human))
Yale University
Curated by ChEMBL
LigandPNGBDBM7747(N-Methyl-4-{[(7-oxo-6,7-dihydro-8H-[1,3]thiazolo[5...)
Affinity DataIC50:  5.60nM. Assay description: Evaluated for inhibition of human cyclin dependent kinase 2 (CDK2)
In DepthDetails ArticlePubMed
TargetCyclin-A2/Cyclin-dependent kinase 2(Homo sapiens (Human))
Glaxosmithkline
LigandPNGBDBM7747(N-Methyl-4-{[(7-oxo-6,7-dihydro-8H-[1,3]thiazolo[5...)
Affinity DataIC50:  5.60nM. Assay description: The biochemical activity of compounds was determined by incubation with specific enzymes and substrates in the presence 1.4 uM ATP/[gamma-32P] ATP. A...
In DepthDetails ArticlePubMed