BDBM7754 4-({[(12Z)-11-oxo-3-thia-5,10-diazatricyclo[7.3.0.0^{2,6}]dodeca-1,4,6,8-tetraen-12-ylidene]methyl}amino)-N-phenylbenzene-1-sulfonamide::4-{[(7-Oxo-6,7-dihydro-8H-[1,3]thiazolo[5,4-e]indol-8-ylidene)methyl]amino}-N-phenylbenzenesulfonamide::Oxindole-Based Inhibitor 90
SMILES O=C1Nc2ccc3ncsc3c2C1C=Nc1ccc(cc1)S(=O)(=O)Nc1ccccc1
InChI Key InChIKey=KDKUNKCGYYDVFM-UHFFFAOYSA-N
Data  3 IC50
  Tab Delimited (TSV)   2D SDfile   Computed 3D by Vconf -m prep SDfile
Find this compound or compounds like it in BindingDB:
Activity Spreadsheet -- Enzyme Inhibition Constant Data from BindingDB
Found 3 hits for monomerid = 7754
TargetCyclin-dependent kinase/G2/mitotic-specific cyclin- 1(Homo sapiens (Human))
Glaxosmithkline
LigandPNGBDBM7754(4-({[(12Z)-11-oxo-3-thia-5,10-diazatricyclo[7.3.0....)
Affinity DataIC50:  41nM. Assay description: The biochemical activity of compounds was determined by incubation with specific enzymes and substrates in the presence 1.4 uM ATP/[gamma-32P] ATP. A...
In DepthDetails ArticlePubMed
TargetCyclin-dependent kinase 2(Homo sapiens (Human))
Yale University
Curated by ChEMBL
LigandPNGBDBM7754(4-({[(12Z)-11-oxo-3-thia-5,10-diazatricyclo[7.3.0....)
Affinity DataIC50:  4.30nM. Assay description: Evaluated for inhibition of human cyclin dependent kinase 2 (CDK2)
In DepthDetails ArticlePubMed
TargetCyclin-A2/Cyclin-dependent kinase 2(Homo sapiens (Human))
Glaxosmithkline
LigandPNGBDBM7754(4-({[(12Z)-11-oxo-3-thia-5,10-diazatricyclo[7.3.0....)
Affinity DataIC50:  4.30nM. Assay description: The biochemical activity of compounds was determined by incubation with specific enzymes and substrates in the presence 1.4 uM ATP/[gamma-32P] ATP. A...
In DepthDetails ArticlePubMed