BDBM77807 US10245267, Example 256::US10709712, Example 256::US9694016, 256
SMILES CCOc1ncc(cc1N1CCOCC1)-c1cc(ccc1C)C(=O)Nc1cc(ccc1F)C(C)=C
InChI Key InChIKey=DVBQSUVLJKVUBQ-UHFFFAOYSA-N
Data  6 IC50
  Tab Delimited (TSV)   2D SDfile   Computed 3D by Vconf -m prep SDfile
Find this compound or compounds like it in BindingDB:
Activity Spreadsheet -- Enzyme Inhibition Constant Data from BindingDB
Found 6 hits for monomerid = 77807
TargetSerine/threonine-protein kinase B-raf [V600E](Homo sapiens (Human))
Novartis
US Patent
LigandPNGBDBM77807(US10245267, Example 256 | US10709712, Example 256 ...)
Affinity DataIC50:  1.80nMpH: 7.5 T: 2°C. Assay description: Raf and biotinylated Mek, kinase dead, were combined at 2x final concentrations in assay buffer (50 mM Tris, pH 7.5, 15 mM MgCl2, 0.01% BSA and 1 mM ...
Ligand InfoPC cidPC sid
In DepthDetails US Patent
TargetRAF proto-oncogene serine/threonine-protein kinase [Y340E,Y341E](Homo sapiens (Human))
Novartis
US Patent
LigandPNGBDBM77807(US10245267, Example 256 | US10709712, Example 256 ...)
Affinity DataIC50:  0.400nMpH: 7.5 T: 2°C. Assay description: Raf and biotinylated Mek, kinase dead, were combined at 2x final concentrations in assay buffer (50 mM Tris, pH 7.5, 15 mM MgCl2, 0.01% BSA and 1 mM ...
Ligand InfoPC cidPC sid
In DepthDetails US Patent
TargetRAF proto-oncogene serine/threonine-protein kinase(Homo sapiens (Human))
Novartis
US Patent
LigandPNGBDBM77807(US10245267, Example 256 | US10709712, Example 256 ...)
Affinity DataIC50:  0.400nM. Assay description: C-Raf TR refers to a truncated C-Raf protein, a Δ1-324 deletion mutant.C-Raf FL refers to the full-length C-Raf protein.Full length MEK1 with an...
Ligand InfoPC cidPC sid
In DepthDetails US Patent
TargetRAF proto-oncogene serine/threonine-protein kinase(Homo sapiens (Human))
Novartis
US Patent
LigandPNGBDBM77807(US10245267, Example 256 | US10709712, Example 256 ...)
Affinity DataIC50:  0.400nM. Assay description: Raf and biotinylated Mek, kinase dead, were combined at 2× final concentrations in assay buffer (50 mM Tris, pH 7.5, 15 mM MgCl2, 0.01% BSA and 1 mM ...
Ligand InfoPC cidPC sid
In DepthDetails US Patent
TargetSerine/threonine-protein kinase B-raf [V600E](Homo sapiens (Human))
Novartis
US Patent
LigandPNGBDBM77807(US10245267, Example 256 | US10709712, Example 256 ...)
Affinity DataIC50:  1.80nM. Assay description: C-Raf TR refers to a truncated C-Raf protein, a Δ1-324 deletion mutant.C-Raf FL refers to the full-length C-Raf protein.Full length MEK1 with an...
Ligand InfoPC cidPC sid
In DepthDetails US Patent
TargetSerine/threonine-protein kinase B-raf [V600E](Homo sapiens (Human))
Novartis
US Patent
LigandPNGBDBM77807(US10245267, Example 256 | US10709712, Example 256 ...)
Affinity DataIC50:  1.80nM. Assay description: Raf and biotinylated Mek, kinase dead, were combined at 2× final concentrations in assay buffer (50 mM Tris, pH 7.5, 15 mM MgCl2, 0.01% BSA and 1 mM ...
Ligand InfoPC cidPC sid
In DepthDetails US Patent