BDBM77972 1-(benzylamino)-7-methyl-3-piperidin-1-yl-6,8-dihydro-5H-2,7-naphthyridine-4-carbonitrile::1-(benzylamino)-7-methyl-3-piperidino-6,8-dihydro-5H-2,7-naphthyridine-4-carbonitrile::7-methyl-1-[(phenylmethyl)amino]-3-(1-piperidinyl)-6,8-dihydro-5H-2,7-naphthyridine-4-carbonitrile::7-methyl-1-[(phenylmethyl)amino]-3-piperidin-1-yl-6,8-dihydro-5H-2,7-naphthyridine-4-carbonitrile::MLS000071265::SMR000039514::cid_658604
SMILES CN1CCc2c(C1)c(NCc1ccccc1)nc(N1CCCCC1)c2C#N
InChI Key InChIKey=BGTVSCUIMOUGOF-UHFFFAOYSA-N
Data  1 IC50
  Tab Delimited (TSV)   2D SDfile   Computed 3D by Vconf -m prep SDfile
Find this compound or compounds like it in BindingDB:
Activity Spreadsheet -- Enzyme Inhibition Constant Data from BindingDB
Found 1 hit for monomerid = 77972
TargetMitochondrial import inner membrane translocase subunit TIM10(Saccharomyces cerevisiae S288c)
Burnham Center For Chemical Genomics
Curated by PubChem BioAssay
LigandPNGBDBM77972(1-(benzylamino)-7-methyl-3-piperidin-1-yl-6,8-dihy...)
Affinity DataIC50:  1.60E+4nM. Assay description: Data Source: Sanford-Burnham Center for Chemical Genomics (SBCCG) Source Affiliation: Sanford-Burnham Medical Research Institute(SBMRI, San Diego, CA...
In DepthDetails PCBioAssay