BDBM7809 1-(3-phenylpropyl)-2,5-dihydro-1H-pyrrole-2,5-dione::Maleimide-Related Compound 8::N-(3-Phenyl-propyl)-maleimide
SMILES O=C1C=CC(=O)N1CCCc1ccccc1
InChI Key InChIKey=HYGJCMOQZIOUMR-UHFFFAOYSA-N
Data  1 IC50
  Tab Delimited (TSV)   2D SDfile   Computed 3D by Vconf -m prep SDfile
Find this compound or compounds like it in BindingDB:
Activity Spreadsheet -- Enzyme Inhibition Constant Data from BindingDB
Found 1 hit for monomerid = 7809
TargetGlycogen synthase kinase-3 beta [7-25](Oryctolagus cuniculus (rabbit))
Instituto De Quimica Medica (Csic)
LigandPNGBDBM7809(1-(3-phenylpropyl)-2,5-dihydro-1H-pyrrole-2,5-dion...)
Affinity DataIC50:  3.00E+3nMpH: 7.5 T: 2°C. Assay description: Kinase activities were assayed in buffers containing substrate, enzyme, and inhibitor at 37 °C in the presence of 15 uM ATP/ [gamma-32P] ATP. 32...
In DepthDetails ArticlePubMed