BDBM7812 2,5-dihydrofuran-2,5-dione::Maleimide-Related Compound 11
SMILES O=C1OC(=O)C=C1
InChI Key InChIKey=FPYJFEHAWHCUMM-UHFFFAOYSA-N
Data  1 IC50
  Tab Delimited (TSV)   2D SDfile   Computed 3D by Vconf -m prep SDfile
Find this compound or compounds like it in BindingDB:
Activity Spreadsheet -- Enzyme Inhibition Constant Data from BindingDB
Found 1 hit for monomerid = 7812
TargetGlycogen synthase kinase-3 beta [7-25](Oryctolagus cuniculus (rabbit))
Instituto De Quimica Medica (Csic)
LigandPNGBDBM7812(2,5-dihydrofuran-2,5-dione | Maleimide-Related Com...)
Affinity DataIC50: >1.00E+5nMpH: 7.5 T: 2°C. Assay description: Kinase activities were assayed in buffers containing substrate, enzyme, and inhibitor at 37 °C in the presence of 15 uM ATP/ [gamma-32P] ATP. 32...
In DepthDetails ArticlePubMed