BDBM78585 MLS000560150::SMR000127373::cid_9549887
SMILES [Cl-].CCCCc1cn(nn1)[C@@H](CCCC[NH3+])C(=O)N1CCN(CC1)c1nc(NCCOCCOCCOCC#C)nc(n1)N1CCN(CC1)C(=O)[C@H]([C@@H](C)CC)n1cc(CCC\N=C(/N)[NH3+])nn1
InChI Key InChIKey=LWNMTWLAKCZEFK-CCIIHQAZSA-O
Data  1 IC50
  Tab Delimited (TSV)   2D SDfile   Computed 3D by Vconf -m prep SDfile
Find this compound or compounds like it in BindingDB:
Activity Spreadsheet -- Enzyme Inhibition Constant Data from BindingDB
Found 1 hit for monomerid = 78585
TargetUbiquitin-conjugating enzyme E2 N(Homo sapiens (Human))
Burnham Center For Chemical Genomics
Curated by PubChem BioAssay
LigandPNGBDBM78585(MLS000560150 | SMR000127373 | cid_9549887)
Affinity DataIC50: >2.00E+4nM. Assay description: Data Source: Sanford-Burnham Center for Chemical Genomics (SBCCG) Source Affiliation: Sanford-Burnham Medical Research Institute (SBMRI, San Diego CA...
In DepthDetails PCBioAssay