BDBM78918 MLS000833958::N'3-(2-chlorobenzoyl)-1-(4-fluorophenyl)-4-oxo-1,4-dihydropyridazine-3-carbohydrazide::N'-(2-chlorobenzoyl)-1-(4-fluorophenyl)-4-keto-pyridazine-3-carbohydrazide::N'-(2-chlorobenzoyl)-1-(4-fluorophenyl)-4-oxopyridazine-3-carbohydrazide::N'-(2-chlorophenyl)carbonyl-1-(4-fluorophenyl)-4-oxidanylidene-pyridazine-3-carbohydrazide::N'-[(2-chlorophenyl)-oxomethyl]-1-(4-fluorophenyl)-4-oxo-3-pyridazinecarbohydrazide::SMR000461477::cid_2745063
SMILES Fc1ccc(cc1)-n1ccc(=O)c(n1)C(=O)NNC(=O)c1ccccc1Cl
InChI Key InChIKey=NSFTZKZJOFVISJ-UHFFFAOYSA-N
Data  3 IC50
  Tab Delimited (TSV)   2D SDfile   Computed 3D by Vconf -m prep SDfile
Find this compound or compounds like it in BindingDB:
Activity Spreadsheet -- Enzyme Inhibition Constant Data from BindingDB
Found 3 hits for monomerid = 78918
TargetUbiquitin-conjugating enzyme E2 N(Homo sapiens (Human))
Burnham Center For Chemical Genomics
Curated by PubChem BioAssay
LigandPNGBDBM78918(MLS000833958 | N'3-(2-chlorobenzoyl)-1-(4-fluo...)
Affinity DataIC50:  9.90E+3nM. Assay description: Data Source: Sanford-Burnham Center for Chemical Genomics (SBCCG) Source Affiliation: Sanford-Burnham Medical Research Institute (SBMRI, San Diego CA...
In DepthDetails PCBioAssay
TargetUbiquitin-conjugating enzyme E2 N(Homo sapiens (Human))
Burnham Center For Chemical Genomics
Curated by PubChem BioAssay
LigandPNGBDBM78918(MLS000833958 | N'3-(2-chlorobenzoyl)-1-(4-fluo...)
Affinity DataIC50:  4.29E+3nM. Assay description: Data Source: Sanford-Burnham Center for Chemical Genomics (SBCCG) Source Affiliation: Sanford-Burnham Medical Research Institute (SBMRI, San Diego CA...
In DepthDetails PCBioAssay
TargetBcl-2-related protein A1(Mus musculus (Mouse))
Burnham Center For Chemical Genomics
Curated by PubChem BioAssay
LigandPNGBDBM78918(MLS000833958 | N'3-(2-chlorobenzoyl)-1-(4-fluo...)
Affinity DataIC50: >2.00E+4nM. Assay description: Data Source: Sanford-Burnham Center for Chemical Genomics (SBCCG) Source Affiliation: Sanford-Burnham Medical Research Institute (SBMRI, San Diego CA...
In DepthDetails PCBioAssay