BDBM79094 (2S)-2-N-[(2R)-2-(4-cyclohexylbutylamino)-3-methylbutyl]-1-N-methylhexane-1,2-diamine::(2S)-N2-[(2R)-2-(4-cyclohexylbutylamino)-3-methyl-butyl]-N1-methyl-hexane-1,2-diamine::(2S)-N2-[(2R)-2-(4-cyclohexylbutylamino)-3-methylbutyl]-N1-methylhexane-1,2-diamine::4-cyclohexylbutyl-[(1R)-2-methyl-1-[[[(1S)-1-(methylaminomethyl)pentyl]amino]methyl]propyl]amine::MLS001242665::SMR000673946::cid_24793490
SMILES CCCC[C@@H](CNC)NC[C@H](NCCCCC1CCCCC1)C(C)C
InChI Key InChIKey=NILVVGVMCDISIM-VXKWHMMOSA-N
Data  1 IC50
  Tab Delimited (TSV)   2D SDfile   Computed 3D by Vconf -m prep SDfile
Find this compound or compounds like it in BindingDB:
Activity Spreadsheet -- Enzyme Inhibition Constant Data from BindingDB
Found 1 hit for monomerid = 79094
TargetUbiquitin-conjugating enzyme E2 N(Homo sapiens (Human))
Burnham Center For Chemical Genomics
Curated by PubChem BioAssay
LigandPNGBDBM79094((2S)-2-N-[(2R)-2-(4-cyclohexylbutylamino)-3-methyl...)
Affinity DataIC50: >2.00E+4nM. Assay description: Data Source: Sanford-Burnham Center for Chemical Genomics (SBCCG) Source Affiliation: Sanford-Burnham Medical Research Institute (SBMRI, San Diego CA...
In DepthDetails PCBioAssay