BDBM79317 (2R)-1-(4-cyclohexylbutyl)-2-(1-naphthalenylmethyl)piperazine::(2R)-1-(4-cyclohexylbutyl)-2-(1-naphthylmethyl)piperazine::(2R)-1-(4-cyclohexylbutyl)-2-(naphthalen-1-ylmethyl)piperazine::MLS002471738::SMR001395153::cid_44143119
SMILES C(CCN1CCNC[C@H]1Cc1cccc2ccccc12)CC1CCCCC1
InChI Key InChIKey=HGBVHOKAEPDUAO-XMMPIXPASA-N
Data  1 IC50
  Tab Delimited (TSV)   2D SDfile   Computed 3D by Vconf -m prep SDfile
Find this compound or compounds like it in BindingDB:
Activity Spreadsheet -- Enzyme Inhibition Constant Data from BindingDB
Found 1 hit for monomerid = 79317
TargetUbiquitin-conjugating enzyme E2 N(Homo sapiens (Human))
Burnham Center For Chemical Genomics
Curated by PubChem BioAssay
LigandPNGBDBM79317((2R)-1-(4-cyclohexylbutyl)-2-(1-naphthalenylmethyl...)
Affinity DataIC50: >2.00E+4nM. Assay description: Data Source: Sanford-Burnham Center for Chemical Genomics (SBCCG) Source Affiliation: Sanford-Burnham Medical Research Institute (SBMRI, San Diego CA...
In DepthDetails PCBioAssay