BDBM79402 1-(2,4-dichlorophenyl)-2-[5-(4-fluorobenzoyl)-2,8-dimethyl-3,4,4a,9b-tetrahydro-1H-pyrid[4,3-b]indol-2-ium-2-yl]ethanone;chloride::1-(2,4-dichlorophenyl)-2-[5-(4-fluorobenzoyl)-2,8-dimethyl-3,4,4a,9b-tetrahydro-1H-pyrido[4,3-b]indol-2-ium-2-yl]ethanone;chloride::1-(2,4-dichlorophenyl)-2-[5-(4-fluorophenyl)carbonyl-2,8-dimethyl-3,4,4a,9b-tetrahydro-1H-pyrido[4,3-b]indol-2-ium-2-yl]ethanone;chloride::1-(2,4-dichlorophenyl)-2-[5-[(4-fluorophenyl)-oxomethyl]-2,8-dimethyl-3,4,4a,9b-tetrahydro-1H-pyrido[4,3-b]indol-2-ium-2-yl]ethanone;chloride::MLS002244791::SMR001308464::cid_16237690
SMILES Cc1ccc2N(C3CC[N+](C)(CC(=O)c4ccc(Cl)cc4Cl)CC3c2c1)C(=O)c1ccc(F)cc1
InChI Key InChIKey=AZYVKUFRFDZGKF-UHFFFAOYSA-N
Data  3 IC50
  Tab Delimited (TSV)   2D SDfile   Computed 3D by Vconf -m prep SDfile
Find this compound or compounds like it in BindingDB:
Activity Spreadsheet -- Enzyme Inhibition Constant Data from BindingDB
Found 3 hits for monomerid = 79402
TargetDNA dC->dU-editing enzyme APOBEC-3A(Homo sapiens (Human))
Burnham Center For Chemical Genomics
Curated by PubChem BioAssay
LigandPNGBDBM79402(1-(2,4-dichlorophenyl)-2-[5-(4-fluorobenzoyl)-2,8-...)
Affinity DataIC50:  2.65E+3nMT: 2°C. Assay description: Data Source: Sanford-Burnham Center for Chemical Genomics (SBCCG) Source Affiliation: Sanford-Burnham Medical Research Institute (SBMRI, San Diego, C...
In DepthDetails PCBioAssay
TargetDNA dC->dU-editing enzyme APOBEC-3G(Homo sapiens (Human))
Burnham Center For Chemical Genomics
Curated by PubChem BioAssay
LigandPNGBDBM79402(1-(2,4-dichlorophenyl)-2-[5-(4-fluorobenzoyl)-2,8-...)
Affinity DataIC50:  2.88E+3nMT: 2°C. Assay description: Data Source: Sanford-Burnham Center for Chemical Genomics (SBCCG) Source Affiliation: Sanford-Burnham Medical Research Institute (SBMRI, San Diego, C...
In DepthDetails PCBioAssay
TargetUbiquitin-conjugating enzyme E2 N(Homo sapiens (Human))
Burnham Center For Chemical Genomics
Curated by PubChem BioAssay
LigandPNGBDBM79402(1-(2,4-dichlorophenyl)-2-[5-(4-fluorobenzoyl)-2,8-...)
Affinity DataIC50: >2.00E+4nM. Assay description: Data Source: Sanford-Burnham Center for Chemical Genomics (SBCCG) Source Affiliation: Sanford-Burnham Medical Research Institute (SBMRI, San Diego CA...
In DepthDetails PCBioAssay