BDBM79621 4-(4-methyl-2-quinolinyl)-2,3-dihydro-1,4-benzoxazine;2,2,2-trifluoroacetic acid::4-(4-methyl-2-quinolyl)-2,3-dihydro-1,4-benzoxazine;2,2,2-trifluoroacetic acid::4-(4-methylquinolin-2-yl)-2,3-dihydro-1,4-benzoxazine;2,2,2-trifluoroacetic acid::4-(4-methylquinolin-2-yl)-2,3-dihydro-1,4-benzoxazine;2,2,2-tris(fluoranyl)ethanoic acid::VU0418913-1::cid_46259350
SMILES Cc1cc(nc2ccccc12)N1CCOc2ccccc12
InChI Key InChIKey=UCYRJPJOKYUWTP-UHFFFAOYSA-N
Data  1 IC50
  Tab Delimited (TSV)   2D SDfile   Computed 3D by Vconf -m prep SDfile
Find this compound or compounds like it in BindingDB:
Activity Spreadsheet -- Enzyme Inhibition Constant Data from BindingDB
Found 1 hit for monomerid = 79621
TargetShort transient receptor potential channel 4(Mus musculus)
Johns Hopkins Ion Channel Center
Curated by PubChem BioAssay
LigandPNGBDBM79621(4-(4-methyl-2-quinolinyl)-2,3-dihydro-1,4-benzoxaz...)
Affinity DataIC50:  2.45E+4nM. Assay description: The inhibitory effects of test compounds on TRPC4 channels were evaluated in electrophysiological assays using a QPatch16 automated electrophysiology...
Ligand InfoPC cidPC sid
In DepthDetails PCBioAssay