BDBM80219 3-(benzylsulfanylmethyl)-4-ethyl-1H-1,2,4-triazole-5-thione::3-[(benzylthio)methyl]-4-ethyl-1H-1,2,4-triazole-5-thione::4-ethyl-3-[(phenylmethylsulfanyl)methyl]-1H-1,2,4-triazole-5-thione::4-ethyl-3-[(phenylmethylthio)methyl]-1H-1,2,4-triazole-5-thione::5-[(benzylthio)methyl]-4-ethyl-4H-1,2,4-triazole-3-thiol::MLS000662205::SMR000293643::cid_2200728
SMILES CCn1c(CSCc2ccccc2)n[nH]c1=S
InChI Key InChIKey=RZEKUZLHJKZOPY-UHFFFAOYSA-N
Data  2 IC50
  Tab Delimited (TSV)   2D SDfile   Computed 3D by Vconf -m prep SDfile
Find this compound or compounds like it in BindingDB:
Activity Spreadsheet -- Enzyme Inhibition Constant Data from BindingDB
Found 2 hits for monomerid = 80219
TargetDNA dC->dU-editing enzyme APOBEC-3A(Homo sapiens (Human))
Burnham Center For Chemical Genomics
Curated by PubChem BioAssay
LigandPNGBDBM80219(3-(benzylsulfanylmethyl)-4-ethyl-1H-1,2,4-triazole...)
Affinity DataIC50: >1.00E+5nMT: 2°C. Assay description: Data Source: Sanford-Burnham Center for Chemical Genomics (SBCCG) Source Affiliation: Sanford-Burnham Medical Research Institute (SBMRI, San Diego, C...
Ligand InfoPC cidPC sid
In DepthDetails PCBioAssay
TargetDNA dC->dU-editing enzyme APOBEC-3G(Homo sapiens (Human))
Burnham Center For Chemical Genomics
Curated by PubChem BioAssay
LigandPNGBDBM80219(3-(benzylsulfanylmethyl)-4-ethyl-1H-1,2,4-triazole...)
Affinity DataIC50:  8.31E+3nMT: 2°C. Assay description: Data Source: Sanford-Burnham Center for Chemical Genomics (SBCCG) Source Affiliation: Sanford-Burnham Medical Research Institute (SBMRI, San Diego, C...
Ligand InfoPC cidPC sid
In DepthDetails PCBioAssay