BDBM8048 2-Anilino-4-(thiazol-5-yl)pyrimidine deriv. 19::4-(2,4-dimethyl-1,3-thiazol-5-yl)-N-[3-(trifluoromethyl)phenyl]pyrimidin-2-amine::[4-(2,4-Dimethylthiazol-5-yl)pyrimidin-2-yl]-(3-trifluoromethylphenyl)amine
SMILES Cc1nc(C)c(s1)-c1ccnc(Nc2cccc(c2)C(F)(F)F)n1
InChI Key InChIKey=OBQRUVGOWSHCPO-UHFFFAOYSA-N
Data  2 KI
  Tab Delimited (TSV)   2D SDfile   Computed 3D by Vconf -m prep SDfile
Find this compound or compounds like it in BindingDB:
Activity Spreadsheet -- Enzyme Inhibition Constant Data from BindingDB
Found 2 hits for monomerid = 8048
TargetCyclin-dependent kinase 4/G1/S-specific cyclin-D1(Homo sapiens (Human))
Cyclacel
LigandPNGBDBM8048(2-Anilino-4-(thiazol-5-yl)pyrimidine deriv. 19 | 4...)
Affinity DataKi: >2.00E+4nM ΔG°: >-6.51kcal/moleT: 2°C. Assay description: In vitro kinase assay using purified enzyme, was incubated at 30 °C with substrate, and test compounds in the presence of 100 uM ATP/ [gamma-32P...
In DepthDetails ArticlePubMed
TargetCyclin-dependent kinase 2/G1/S-specific cyclin-E1(Homo sapiens (Human))
Cyclacel
LigandPNGBDBM8048(2-Anilino-4-(thiazol-5-yl)pyrimidine deriv. 19 | 4...)
Affinity DataKi: >2.00E+4nM ΔG°: >-6.51kcal/molepH: 7.4 T: 2°C. Assay description: In vitro kinase assay using purified enzyme, was incubated at 30 °C with substrate, and test compounds in the presence of 100 uM ATP/ [gamma-32P...
In DepthDetails ArticlePubMed