BDBM80788 (5E)-2,4-dimethyl-5-[2-(o-anisidino)-4H-1,3,4-thiadiazin-5-ylidene]pyrrole-3-carboxylic acid ethyl ester::(5E)-5-[2-(2-methoxyanilino)-4H-1,3,4-thiadiazin-5-ylidene]-2,4-dimethyl-3-pyrrolecarboxylic acid ethyl ester::MLS000336298::SMR000253852::cid_15945255::ethyl (5E)-5-[2-(2-methoxyanilino)-4H-1,3,4-thiadiazin-5-ylidene]-2,4-dimethylpyrrole-3-carboxylate::ethyl (5E)-5-[2-[(2-methoxyphenyl)amino]-4H-1,3,4-thiadiazin-5-ylidene]-2,4-dimethyl-pyrrole-3-carboxylate
SMILES CCOC(=O)c1c(C)[nH]c(c1C)C1=NN=C(Nc2ccccc2OC)SC1
InChI Key InChIKey=CSDGYASODCTXAJ-UHFFFAOYSA-N
Data  2 EC50
  Tab Delimited (TSV)   2D SDfile   Computed 3D by Vconf -m prep SDfile
Find this compound or compounds like it in BindingDB:
Activity Spreadsheet -- Enzyme Inhibition Constant Data from BindingDB
Found 2 hits for monomerid = 80788
TargetHexokinase-1(Homo sapiens (Human))
Burnham Center For Chemical Genomics
Curated by PubChem BioAssay
LigandPNGBDBM80788((5E)-2,4-dimethyl-5-[2-(o-anisidino)-4H-1,3,4-thia...)
Affinity DataEC50:  1.53E+4nM. Assay description: Data Source: Sanford-Burnham Center for Chemical Genomics (SBCCG) Source Affiliation: Sanford-Burnham Medical Research Institute (SBMRI, San Diego, C...
In DepthDetails PCBioAssay
TargetHexokinase HKDC1 [W721R](Homo sapiens (Human))
Burnham Center For Chemical Genomics
Curated by PubChem BioAssay
LigandPNGBDBM80788((5E)-2,4-dimethyl-5-[2-(o-anisidino)-4H-1,3,4-thia...)
Affinity DataEC50:  1.50E+4nM. Assay description: Data Source: Sanford-Burnham Center for Chemical Genomics (SBCCG) Source Affiliation: Sanford-Burnham Medical Research Institute (SBMRI, San Diego, C...
In DepthDetails PCBioAssay