BDBM8102 (2S)-N-[(2S,3S)-4-{[(1S)-2-[4-(1-benzofuran-2-yl)phenyl]-1-carbamoylethyl]amino}-3-hydroxy-1-phenylbutan-2-yl]-3-methyl-2-(pyridin-2-ylformamido)butanamide::hydroxylethylamine scaffold 93::hydroxylethylamine scaffold 9{3}
SMILES CC(C)[C@H](NC(=O)c1ccccn1)C(=O)N[C@@H](Cc1ccccc1)[C@@H](O)CN[C@@H](Cc1ccc(cc1)-c1cc2ccccc2o1)C(N)=O
InChI Key InChIKey=UTGLNRLKXCBKGB-ABVVNCBOSA-N
Data  3 KI
  Tab Delimited (TSV)   2D SDfile   Computed 3D by Vconf -m prep SDfile
Find this compound or compounds like it in BindingDB:
Activity Spreadsheet -- Enzyme Inhibition Constant Data from BindingDB
Found 3 hits for monomerid = 8102
TargetPlasmepsin I(Plasmodium falciparum)
Uppsala University
LigandPNGBDBM8102((2S)-N-[(2S,3S)-4-{[(1S)-2-[4-(1-benzofuran-2-yl)p...)
Affinity DataKi:  13nM. Assay description: Enzyme activities were assayed by monitoring the hydrolysis of substrate in the presence or absence of inhibitor compounds. The hydrolysis was record...
Ligand InfoPC cidPC sid
In DepthDetails ArticlePubMed
TargetPlasmepsin II(Plasmodium falciparum)
Uppsala University
LigandPNGBDBM8102((2S)-N-[(2S,3S)-4-{[(1S)-2-[4-(1-benzofuran-2-yl)p...)
Affinity DataKi:  30nM. Assay description: Enzyme activities were assayed by monitoring the hydrolysis of substrate in the presence or absence of inhibitor compounds. The hydrolysis was record...
Ligand InfoPC cidPC sid
In DepthDetails ArticlePubMed
TargetCathepsin D(Homo sapiens (Human))
Uppsala University
LigandPNGBDBM8102((2S)-N-[(2S,3S)-4-{[(1S)-2-[4-(1-benzofuran-2-yl)p...)
Affinity DataKi:  1.40E+3nM. Assay description: Enzyme activities were assayed by monitoring the hydrolysis of substrate in the presence or absence of inhibitor compounds. The hydrolysis was record...
Ligand InfoPC cidPC sid
In DepthDetails ArticlePubMed