BDBM81076 2-[(4-fluorobenzoyl)amino]-5,6-dihydro-4H-cyclopenta[b]thiophene-3-carboxylic acid::2-[(4-fluorophenyl)carbonylamino]-5,6-dihydro-4H-cyclopenta[b]thiophene-3-carboxylic acid::2-[[(4-fluorophenyl)-oxomethyl]amino]-5,6-dihydro-4H-cyclopenta[b]thiophene-3-carboxylic acid::MLS000713389::SMR000272870::cid_828417
SMILES OC(=O)c1c(NC(=O)c2ccc(F)cc2)sc2CCCc12
InChI Key InChIKey=FSAQWXZVBNUNSU-UHFFFAOYSA-N
Data  4 IC50
  Tab Delimited (TSV)   2D SDfile   Computed 3D by Vconf -m prep SDfile
Find this compound or compounds like it in BindingDB:
Activity Spreadsheet -- Enzyme Inhibition Constant Data from BindingDB
Found 4 hits for monomerid = 81076
TargetGlucose-6-phosphate 1-dehydrogenase(Homo sapiens (Human))
Burnham Center For Chemical Genomics
Curated by PubChem BioAssay
LigandPNGBDBM81076(2-[(4-fluorobenzoyl)amino]-5,6-dihydro-4H-cyclopen...)
Affinity DataIC50: >8.00E+4nM. Assay description: Data Source: Sanford-Burnham Center for Chemical Genomics (SBCCG) Source Affiliation: Sanford-Burnham Medical Research Institute (SBMRI, San Diego CA...
In DepthDetails PCBioAssay
TargetGlucose-6-phosphate dehydrogenase-6-phosphogluconolactonase(Plasmodium falciparum 3D7)
Burnham Center For Chemical Genomics
Curated by PubChem BioAssay
LigandPNGBDBM81076(2-[(4-fluorobenzoyl)amino]-5,6-dihydro-4H-cyclopen...)
Affinity DataIC50:  4.13E+4nM. Assay description: Data Source: Sanford-Burnham Center for Chemical Genomics (SBCCG) Source Affiliation: Sanford-Burnham Medical Research Institute (SBMRI, San Diego CA...
In DepthDetails PCBioAssay
TargetGlucose-6-phosphate dehydrogenase-6-phosphogluconolactonase(Plasmodium falciparum 3D7)
Burnham Center For Chemical Genomics
Curated by PubChem BioAssay
LigandPNGBDBM81076(2-[(4-fluorobenzoyl)amino]-5,6-dihydro-4H-cyclopen...)
Affinity DataIC50: >8.00E+4nM. Assay description: Data Source: Sanford-Burnham Center for Chemical Genomics (SBCCG) Source Affiliation: Sanford-Burnham Medical Research Institute (SBMRI, San Diego CA...
In DepthDetails PCBioAssay
TargetGlucose-6-phosphate dehydrogenase-6-phosphogluconolactonase(Plasmodium falciparum 3D7)
Burnham Center For Chemical Genomics
Curated by PubChem BioAssay
LigandPNGBDBM81076(2-[(4-fluorobenzoyl)amino]-5,6-dihydro-4H-cyclopen...)
Affinity DataIC50:  7.80E+3nM. Assay description: Data Source: Sanford-Burnham Center for Chemical Genomics (SBCCG) Source Affiliation: Sanford-Burnham Medical Research Institute (SBMRI, San Diego CA...
In DepthDetails PCBioAssay