BDBM8142 N-[3-methoxy-5-(trifluoromethyl)phenyl]-4-{pyrazolo[1,5-a]pyridazin-3-yl}pyrimidin-2-amine::pyrazolo[1,5-b]pyridazine deriv. 33
SMILES COc1cc(Nc2nccc(n2)-c2cnn3ncccc23)cc(c1)C(F)(F)F
InChI Key InChIKey=GBYZMXCPDFNNOB-UHFFFAOYSA-N
Data  1 KI  3 IC50
  Tab Delimited (TSV)   2D SDfile   Computed 3D by Vconf -m prep SDfile
Find this compound or compounds like it in BindingDB:
Activity Spreadsheet -- Enzyme Inhibition Constant Data from BindingDB
Found 3 hits for monomerid = 8142
TargetGlycogen synthase kinase-3 beta(Homo sapiens (Human))
Glaxosmithkline
LigandPNGBDBM8142(N-[3-methoxy-5-(trifluoromethyl)phenyl]-4-{pyrazol...)
Affinity DataKi:  2nM IC50: <10nM. Assay description: The biochemical activity of compounds was determined by incubation with specific enzyme and substrate in the presence 2.5 uM ATP/ [gamma-32P] ATP. Af...
In DepthDetails ArticlePubMed
TargetCyclin-dependent kinase 4/G1/S-specific cyclin-D1(Homo sapiens (Human))
Glaxosmithkline
LigandPNGBDBM8142(N-[3-methoxy-5-(trifluoromethyl)phenyl]-4-{pyrazol...)
Affinity DataIC50:  199nM. Assay description: The biochemical activity of compounds was determined by incubation with specific enzyme and substrate in the presence 2.5 uM ATP/ [gamma-32P] ATP. Af...
In DepthDetails ArticlePubMed
TargetCyclin-A2/Cyclin-dependent kinase 2(Homo sapiens (Human))
Glaxosmithkline
LigandPNGBDBM8142(N-[3-methoxy-5-(trifluoromethyl)phenyl]-4-{pyrazol...)
Affinity DataIC50:  15nM. Assay description: The biochemical activity of compounds was determined by incubation with specific enzyme and substrate in the presence 2.5 uM ATP/ [gamma-32P] ATP. Af...
In DepthDetails ArticlePubMed