BDBM81681 P1 Phenyl Ring, 22
SMILES NS(=O)(=O)c1ccccc1-c1ccc(NC(=O)C2CCCN2C(=O)Nc2ccc(Br)cc2)c(F)c1
InChI Key InChIKey=HICSFOWYIPJAEW-UHFFFAOYSA-N
Data  1 IC50
  Tab Delimited (TSV)   2D SDfile   Computed 3D by Vconf -m prep SDfile
Find this compound or compounds like it in BindingDB:
Activity Spreadsheet -- Enzyme Inhibition Constant Data from BindingDB
Found 1 hit for monomerid = 81681
TargetCoagulation factor X(Homo sapiens (Human))
Pfizer
LigandPNGBDBM81681(P1 Phenyl Ring, 22)
Affinity DataIC50:  33nM. Assay description: FXa inhibition were determined by using an inhibition assay.
In DepthDetails ArticlePubMed