BDBM81743 Oryzalin, 1
SMILES CCCN(CCC)c1c(cc(cc1N(=O)=O)S(N)(=O)=O)N(=O)=O
InChI Key InChIKey=UNAHYJYOSSSJHH-UHFFFAOYSA-N
Data  2 IC50
  Tab Delimited (TSV)   2D SDfile   Computed 3D by Vconf -m prep SDfile
Find this compound or compounds like it in BindingDB:
Activity Spreadsheet -- Enzyme Inhibition Constant Data from BindingDB
Found 2 hits for monomerid = 81743
TargetTubulin alpha-1A chain(Sus scrofa (Pig))
The Ohio State University
LigandPNGBDBM81743(Oryzalin, 1)
Affinity DataIC50: >4.00E+4nM. Assay description: In vitro activity assay using leishmania tarentolae and porcine brain tubulin.
In DepthDetails ArticlePubMed
TargetTubulin alpha chain(Leishmania tarentolae (Sauroleishmania tarentolae))
The Ohio State University
LigandPNGBDBM81743(Oryzalin, 1)
Affinity DataIC50: >4.00E+4nM. Assay description: In vitro activity assay using leishmania tarentolae and porcine brain tubulin.
In DepthDetails ArticlePubMed