BDBM81756 Chembridge No 9056942, Class 3, 7
SMILES COc1cc(OC)cc(c1)C(=O)NCc1nc(no1)-c1ccccc1
InChI Key InChIKey=KYYJFXPJGCKKBT-UHFFFAOYSA-N
Data  2 IC50
  Tab Delimited (TSV)   2D SDfile   Computed 3D by Vconf -m prep SDfile
Find this compound or compounds like it in BindingDB:
Activity Spreadsheet -- Enzyme Inhibition Constant Data from BindingDB
Found 2 hits for monomerid = 81756
TargetTubulin alpha-1A chain(Sus scrofa (Pig))
The Ohio State University
LigandPNGBDBM81756(Chembridge No 9056942, Class 3, 7)
Affinity DataIC50:  1.40E+5nM. Assay description: In vitro activity assay using leishmania tarentolae and porcine brain tubulin.
In DepthDetails ArticlePubMed
TargetTubulin alpha chain(Leishmania tarentolae (Sauroleishmania tarentolae))
The Ohio State University
LigandPNGBDBM81756(Chembridge No 9056942, Class 3, 7)
Affinity DataIC50:  7.80E+4nM. Assay description: In vitro activity assay using leishmania tarentolae and porcine brain tubulin.
In DepthDetails ArticlePubMed