BDBM81947 CAS_113243-00-8::L-657926
SMILES OC(=O)C[C@@H]1CCCc2c1n(Cc1ccc(Cl)cc1)c1ccc(F)cc21
InChI Key InChIKey=LHJWQVJJSYPRIX-AWEZNQCLSA-N
Data  1 KI  2 IC50
  Tab Delimited (TSV)   2D SDfile   Computed 3D by Vconf -m prep SDfile
Find this compound or compounds like it in BindingDB:
Activity Spreadsheet -- Enzyme Inhibition Constant Data from BindingDB
Found 3 hits for monomerid = 81947
TargetThromboxane A2 receptor(Homo sapiens (Human))
Medical University Of South Carolina
Curated by PDSP Ki Database
LigandPNGBDBM81947(CAS_113243-00-8 | L-657926)
Affinity DataKi:  424nM
In DepthDetails PubMed
TargetThromboxane A2 receptor(Homo sapiens (Human))
Medical University Of South Carolina
Curated by PDSP Ki Database
LigandPNGBDBM81947(CAS_113243-00-8 | L-657926)
Affinity DataIC50:  11.2nM. Assay description: Binding affinity towards Thromboxane A2/ Prostaglandin H2 receptor in human platelet membranes using [125I]- as the radioligand.
In DepthDetails ArticlePubMed
TargetThromboxane A2 receptor(Homo sapiens (Human))
Medical University Of South Carolina
Curated by PDSP Ki Database
LigandPNGBDBM81947(CAS_113243-00-8 | L-657926)
Affinity DataIC50:  11nM. Assay description: Binding affinity towards Thromboxane A2/ Prostaglandin H2 receptor in human platelet membranes using [125I]- as the radioligand.
In DepthDetails ArticlePubMed