BDBM81965 1-(4-ethyl-2,5-dimethoxyphenyl)propan-2-amine::CAS_62066::CHEMBL8224::DOET,(-)::NSC_62066
SMILES CCc1cc(OC)c(CC(C)N)cc1OC
InChI Key InChIKey=HXJKWPGVENNMCC-UHFFFAOYSA-N
Data  8 KI
  Tab Delimited (TSV)   2D SDfile   Computed 3D by Vconf -m prep SDfile
Find this compound or compounds like it in BindingDB:
Activity Spreadsheet -- Enzyme Inhibition Constant Data from BindingDB
Found 8 hits for monomerid = 81965
Target5-hydroxytryptamine receptor 2A(Rattus norvegicus (rat))
Stanford University
Curated by PDSP Ki Database
LigandPNGBDBM81965(1-(4-ethyl-2,5-dimethoxyphenyl)propan-2-amine | CA...)
Affinity DataKi:  0.540nM
In DepthDetails PubMed
Target5-hydroxytryptamine receptor 2B(BOVINE)
Stanford University
Curated by PDSP Ki Database
LigandPNGBDBM81965(1-(4-ethyl-2,5-dimethoxyphenyl)propan-2-amine | CA...)
Affinity DataKi:  80nM
In DepthDetails PubMed
Target5-hydroxytryptamine receptor 2A(Rattus norvegicus (rat))
Stanford University
Curated by PDSP Ki Database
LigandPNGBDBM81965(1-(4-ethyl-2,5-dimethoxyphenyl)propan-2-amine | CA...)
Affinity DataKi:  100nM. Assay description: Displacement of [3H]ketanserin from 5HT2A receptor in Sprague-Dawley rat brain by liquid scintillation spectroscopy
In DepthDetails ArticlePubMed
TargetSerotonin 2 (5-HT2) receptor(RAT)
Virginia Commonwealth University
Curated by ChEMBL
LigandPNGBDBM81965(1-(4-ethyl-2,5-dimethoxyphenyl)propan-2-amine | CA...)
Affinity DataKi:  100nM. Assay description: Binding affinity against 5-hydroxytryptamine 2 receptor of rat frontal cortex using [3H]ketanserin radioligand
In DepthDetails ArticlePubMed
TargetSerotonin 2 (5-HT2) receptor(RAT)
Virginia Commonwealth University
Curated by ChEMBL
LigandPNGBDBM81965(1-(4-ethyl-2,5-dimethoxyphenyl)propan-2-amine | CA...)
Affinity DataKi:  100nM. Assay description: Binding affinity to rat cortical membranes at 5-hydroxytryptamine 2 (5-HT2) receptor using [3H]KET as a radioligand
In DepthDetails ArticlePubMed
TargetSerotonin 2 (5-HT2) receptor(RAT)
Virginia Commonwealth University
Curated by ChEMBL
LigandPNGBDBM81965(1-(4-ethyl-2,5-dimethoxyphenyl)propan-2-amine | CA...)
Affinity DataKi:  100nM. Assay description: Binding affinity towards 5-hydroxytryptamine 2 receptor from frontal cortical regions of male Sprague-Dawley rat homogenates, using [3H]ketanserin as...
In DepthDetails ArticlePubMed
Target5-hydroxytryptamine receptor 2C(Rattus norvegicus (Rat))
Virginia Commonwealth University
Curated by ChEMBL
LigandPNGBDBM81965(1-(4-ethyl-2,5-dimethoxyphenyl)propan-2-amine | CA...)
Affinity DataKi:  101nM. Assay description: Binding affinity towards 5-hydroxytryptamine 1C receptor from frontal cortical regions of male Sprague-Dawley rat homogenates, using [3H]mesulergine ...
In DepthDetails ArticlePubMed
LigandPNGBDBM81965(1-(4-ethyl-2,5-dimethoxyphenyl)propan-2-amine | CA...)
Affinity DataKi:  4.57E+3nM. Assay description: Evaluated for binding affinity towards rat cortical membranes at 5-hydroxytryptamine 1 receptor binding site by using [3H]-5-HT as a radioligand.
In DepthDetails ArticlePubMed