BDBM82080 CAS_82-58-6::LYSERGIC ACID::NSC_622688
SMILES CN1CC(C=C2C1Cc1c[nH]c3cccc2c13)C(O)=O
InChI Key InChIKey=ZAGRKAFMISFKIO-UHFFFAOYSA-N
Data  2 KI
  Tab Delimited (TSV)   2D SDfile   Computed 3D by Vconf -m prep SDfile
Find this compound or compounds like it in BindingDB:
Activity Spreadsheet -- Enzyme Inhibition Constant Data from BindingDB
Found 2 hits for monomerid = 82080
Target5-hydroxytryptamine receptor 5A(MOUSE)
Max-Planck-Institut
Curated by PDSP Ki Database
LigandPNGBDBM82080(CAS_82-58-6 | LYSERGIC ACID | NSC_622688)
Affinity DataKi:  2.00E+3nM
In DepthDetails ArticlePubMed
LigandPNGBDBM82080(CAS_82-58-6 | LYSERGIC ACID | NSC_622688)
Affinity DataKi: >1.00E+4nM
In DepthDetails ArticlePubMed