BDBM82210 CAS_54397-85-2::PG Thromboxane B2::THROMBOXANE B2
SMILES CCCCC[C@H](O)\C=C\[C@H]1OC(O)C[C@H](O)[C@@H]1C\C=C/CCCC(O)=O
InChI Key InChIKey=XNRNNGPBEPRNAR-JQBLCGNGSA-N
Data  1 KI
  Tab Delimited (TSV)   2D SDfile   Computed 3D by Vconf -m prep SDfile
Find this compound or compounds like it in BindingDB:
Activity Spreadsheet -- Enzyme Inhibition Constant Data from BindingDB
Found 1 hit for monomerid = 82210
TargetProstaglandin D2 receptor(RAT)
Kyoto University
Curated by PDSP Ki Database
LigandPNGBDBM82210(CAS_54397-85-2 | PG Thromboxane B2 | THROMBOXANE B...)
Affinity DataKi:  4.20E+3nM
In DepthDetails PubMed