BDBM82388 CCK antagonist synthetic 11
SMILES CN1c2ccccc2C(=N[C@H](Cc2c[nH]c3ccccc23)C1=O)c1ccccc1F
InChI Key InChIKey=CGBANSGENFERAT-JOCHJYFZSA-N
Data  2 KI  3 IC50
  Tab Delimited (TSV)   2D SDfile   Computed 3D by Vconf -m prep SDfile
Find this compound or compounds like it in BindingDB:
Activity Spreadsheet -- Enzyme Inhibition Constant Data from BindingDB
Found 5 hits for monomerid = 82388
TargetCholecystokinin(RAT)
Merck Sharp & Dohme Research Laboratories
Curated by PDSP Ki Database
LigandPNGBDBM82388(CCK antagonist synthetic 11)
Affinity DataKi:  270nM
In DepthDetails ArticlePubMed
TargetGABA(A) receptor-associated protein(GUINEA PIG)
Merck Sharp & Dohme Research Laboratories
Curated by PDSP Ki Database
LigandPNGBDBM82388(CCK antagonist synthetic 11)
Affinity DataKi: >1.00E+4nM
In DepthDetails ArticlePubMed
TargetGastrin/cholecystokinin type B receptor(Homo sapiens (Human))
TBA
Curated by ChEMBL
LigandPNGBDBM82388(CCK antagonist synthetic 11)
Affinity DataIC50:  1.30E+4nM. Assay description: Half-maximal inhibition of binding of [125I]gastrin to guinea pig gastric glands
In DepthDetails ArticlePubMed
LigandPNGBDBM82388(CCK antagonist synthetic 11)
Affinity DataIC50:  270nM. Assay description: Half-maximal inhibition of [125I]-CCK-33 binding to rat pancreas cholecystokinin receptor
In DepthDetails ArticlePubMed
TargetCholecystokinin receptor type A(Cavia porcellus)
TBA
Curated by ChEMBL
LigandPNGBDBM82388(CCK antagonist synthetic 11)
Affinity DataIC50:  1.00E+4nM. Assay description: Half-maximal inhibition of [125I]CCK-33 binding to guinea pig brain(cortex) cholecystokinin receptor
In DepthDetails ArticlePubMed