BDBM82429 2-Ethyl-7-methyl-3-[[2'-(1H-tetrazol-5-yl)biphenyl-4-yl]methyl]-N-(methylsulfonyl)-3H-imidazo[4,5-b]pyridine-5-carboxamide::L-161,713::L-161713
SMILES CCc1nc2c(C)cc(nc2n1Cc1ccc(cc1)-c1ccccc1-c1nnn[nH]1)C(=O)N[S](C)(=O)=O
InChI Key InChIKey=KIUSKMZHDDMBDQ-UHFFFAOYSA-N
Data  2 KI
  Tab Delimited (TSV)   2D SDfile   Computed 3D by Vconf -m prep SDfile
Find this compound or compounds like it in BindingDB:
Activity Spreadsheet -- Enzyme Inhibition Constant Data from BindingDB
Found 2 hits for monomerid = 82429
TargetType-2 angiotensin II receptor(RAT)
Merck Research Laboratories
Curated by PDSP Ki Database
LigandPNGBDBM82429(2-Ethyl-7-methyl-3-[[2'-(1H-tetrazol-5-yl)biph...)
Affinity DataKi:  1.96nM
Ligand InfoPC cidPC sid
In DepthDetails PubMed
TargetType-2 angiotensin II receptor(RAT)
Merck Research Laboratories
Curated by PDSP Ki Database
LigandPNGBDBM82429(2-Ethyl-7-methyl-3-[[2'-(1H-tetrazol-5-yl)biph...)
Affinity DataKi:  329nM
Ligand InfoPC cidPC sid
In DepthDetails PubMed