BDBM82476 CAS_443037::CHLORPROMAZINE-N-OXIDE::NSC_443037
SMILES C[N+](C)([O-])CCCN1c2ccccc2Sc2ccc(Cl)cc12
InChI Key InChIKey=LFDFWIIFGRXCFR-UHFFFAOYSA-N
Data  2 KI
  Tab Delimited (TSV)   2D SDfile   Computed 3D by Vconf -m prep SDfile
Find this compound or compounds like it in BindingDB:
Activity Spreadsheet -- Enzyme Inhibition Constant Data from BindingDB
Found 2 hits for monomerid = 82476
Target5-hydroxytryptamine receptor 7(Rattus norvegicus (rat))
Case Western Reserve University
Curated by PDSP Ki Database
LigandPNGBDBM82476(CAS_443037 | CHLORPROMAZINE-N-OXIDE | NSC_443037)
Affinity DataKi:  5.00E+3nM
In DepthDetails PubMed
Target5-hydroxytryptamine receptor 6(RAT)
Case Western Reserve University
Curated by PDSP Ki Database
LigandPNGBDBM82476(CAS_443037 | CHLORPROMAZINE-N-OXIDE | NSC_443037)
Affinity DataKi:  5.00E+3nM
In DepthDetails PubMed