BDBM82490 TMQ, N-hydroxyethyl
SMILES COc1cc(CC2N(CCO)CCc3cc(O)c(O)cc23)cc(OC)c1OC
InChI Key InChIKey=HHHBMRDMTJXHRY-UHFFFAOYSA-N
Data  2 KI
  Tab Delimited (TSV)   2D SDfile   Computed 3D by Vconf -m prep SDfile
Find this compound or compounds like it in BindingDB:
Activity Spreadsheet -- Enzyme Inhibition Constant Data from BindingDB
Found 2 hits for monomerid = 82490
TargetBeta-2 adrenergic receptor(GUINEA PIG)
Ohio State University
Curated by PDSP Ki Database
LigandPNGBDBM82490(TMQ, N-hydroxyethyl)
Affinity DataKi:  2.75E+3nM
In DepthDetails PubMed
TargetBeta-1 adrenergic receptor(GUINEA PIG)
Ohio State University
Curated by PDSP Ki Database
LigandPNGBDBM82490(TMQ, N-hydroxyethyl)
Affinity DataKi:  5.37E+3nM
In DepthDetails PubMed