BDBM82520 BRL44408::CAS_121850::NSC_121850
SMILES CC1N(CC2=NCCN2)Cc2ccccc12
InChI Key InChIKey=SGOFAUSEYBZKDQ-UHFFFAOYSA-N
Data  2 KI
  Tab Delimited (TSV)   2D SDfile   Computed 3D by Vconf -m prep SDfile
Find this compound or compounds like it in BindingDB:
Activity Spreadsheet -- Enzyme Inhibition Constant Data from BindingDB
Found 2 hits for monomerid = 82520
TargetAlpha-2A adrenergic receptor(Homo sapiens (Human))
University Of Michigan
Curated by PDSP Ki Database
LigandPNGBDBM82520(BRL44408 | CAS_121850 | NSC_121850)
Affinity DataKi:  5.68nM
In DepthDetails PubMed
TargetAlpha-2B adrenergic receptor(Homo sapiens (Human))
University Of Michigan
Curated by PDSP Ki Database
LigandPNGBDBM82520(BRL44408 | CAS_121850 | NSC_121850)
Affinity DataKi:  651nM
In DepthDetails PubMed