BDBM82645 7-(2-morpholin-4-ylethyl)-8-phenyl-3-propyl-purine-2,6-dione::7-(2-morpholin-4-ylethyl)-8-phenyl-3-propylpurine-2,6-dione::7-(2-morpholinoethyl)-8-phenyl-3-propyl-xanthine::7-[2-(4-morpholinyl)ethyl]-8-phenyl-3-propylpurine-2,6-dione::MLS000566253::SMR000153428::cid_3365111
SMILES CCCn1c2nc(-c3ccccc3)n(CCN3CCOCC3)c2c(=O)[nH]c1=O
InChI Key InChIKey=WEASERGJADEIAM-UHFFFAOYSA-N
Data  1 IC50
  Tab Delimited (TSV)   2D SDfile   Computed 3D by Vconf -m prep SDfile
Find this compound or compounds like it in BindingDB:
Activity Spreadsheet -- Enzyme Inhibition Constant Data from BindingDB
Found 1 hit for monomerid = 82645
TargetCarboxy-terminal domain RNA polymerase II polypeptide A small phosphatase 1(Homo sapiens (Human))
Burnham Center For Chemical Genomics
Curated by PubChem BioAssay
LigandPNGBDBM82645(7-(2-morpholin-4-ylethyl)-8-phenyl-3-propyl-purine...)
Affinity DataIC50:  4.78E+4nM. Assay description: Data Source: Sanford-Burnham Center for Chemical Genomics (SBCCG) Source Affiliation: Sanford-Burnham Medical Research Institute (SBMRI, San Diego, C...
In DepthDetails PCBioAssay