BDBM8266 2-chloro-5-[(2,5-dioxo-4-phenyl-2,5-dihydro-1H-pyrrol-3-yl)amino]benzoic acid::4-arylmaleimide deriv. 6-w
SMILES OC(=O)c1cc(NC2=C(C(=O)NC2=O)c2ccccc2)ccc1Cl
InChI Key InChIKey=RLMJMTPRBLGCRP-UHFFFAOYSA-N
Data  2 IC50
  Tab Delimited (TSV)   2D SDfile   Computed 3D by Vconf -m prep SDfile
Find this compound or compounds like it in BindingDB:
Activity Spreadsheet -- Enzyme Inhibition Constant Data from BindingDB
Found 2 hits for monomerid = 8266
TargetGlycogen synthase kinase-3 beta(Homo sapiens (Human))
University Of Jordan
Curated by ChEMBL
LigandPNGBDBM8266(2-chloro-5-[(2,5-dioxo-4-phenyl-2,5-dihydro-1H-pyr...)
Affinity DataIC50:  143nM. Assay description: Inhibition of recombinant GSK3-beta
In DepthDetails ArticlePubMed
TargetGlycogen synthase kinase-3 alpha(Homo sapiens (Human))
Smithkline Beecham Pharmaceuticals
LigandPNGBDBM8266(2-chloro-5-[(2,5-dioxo-4-phenyl-2,5-dihydro-1H-pyr...)
Affinity DataIC50:  143nM. Assay description: The biochemical activity of compounds was determined by incubation with specific enzyme and substrate in the presence 10 uM ATP/ [gamma-33P] ATP. Aft...
In DepthDetails ArticlePubMed