BDBM82702 (4E)-4-[[(2,4-dinitrophenyl)hydrazo]methylidene]-5-methyl-2-(4-methylphenyl)-3-pyrazolone::(4E)-4-[[2-(2,4-dinitrophenyl)hydrazinyl]methylidene]-5-methyl-2-(4-methylphenyl)pyrazol-3-one::(4E)-4-[[N'-(2,4-dinitrophenyl)hydrazino]methylene]-5-methyl-2-(p-tolyl)-2-pyrazolin-3-one::(4Z)-4-[[N''-(2,4-dinitrophenyl)hydrazino]methylene]-5-methyl-2-(p-tolyl)-2-pyrazolin-3-one::(4Z)-4-[[N'-(2,4-dinitrophenyl)hydrazino]methylene]-5-methyl-2-(p-tolyl)-2-pyrazolin-3-one::4-[N'-(2,4-Dinitro-phenyl)-hydrazinomethylene]-5-methyl-2-p-tolyl-2,4-dihydro-pyrazol-3-one::MLS000554589::SMR000171521::cid_12004425
SMILES Cc1[n-]n(-c2ccc(C)cc2)c(=O)c1C[NH+]=Nc1ccc(cc1[N+]([O-])=O)[N+]([O-])=O
InChI Key InChIKey=PDDLGXMUOJZBJQ-UHFFFAOYSA-N
Data  4 IC50  1 EC50
  Tab Delimited (TSV)   2D SDfile   Computed 3D by Vconf -m prep SDfile
Find this compound or compounds like it in BindingDB:
Activity Spreadsheet -- Enzyme Inhibition Constant Data from BindingDB
Found 5 hits for monomerid = 82702
TargetCarboxy-terminal domain RNA polymerase II polypeptide A small phosphatase 1(Homo sapiens (Human))
Burnham Center For Chemical Genomics
Curated by PubChem BioAssay
LigandPNGBDBM82702((4E)-4-[[(2,4-dinitrophenyl)hydrazo]methylidene]-5...)
Affinity DataIC50:  6.07E+3nM. Assay description: Data Source: Sanford-Burnham Center for Chemical Genomics (SBCCG) Source Affiliation: Sanford-Burnham Medical Research Institute (SBMRI, San Diego, C...
In DepthDetails PCBioAssay
TargetCorticotropin-releasing factor-binding protein(Homo sapiens (Human))
Burnham Center For Chemical Genomics
Curated by PubChem BioAssay
LigandPNGBDBM82702((4E)-4-[[(2,4-dinitrophenyl)hydrazo]methylidene]-5...)
Affinity DataEC50: >5.30E+4nM. Assay description: Data Source: Sanford-Burnham Center for Chemical Genomics (SBCCG) Source Affiliation: Sanford-Burnham Medical Research Institute (SBMRI, San Diego, C...
In DepthDetails PCBioAssay
TargetSentrin-specific protease 8(Homo sapiens (Human))
Burnham Center For Chemical Genomics
Curated by PubChem BioAssay
LigandPNGBDBM82702((4E)-4-[[(2,4-dinitrophenyl)hydrazo]methylidene]-5...)
Affinity DataIC50: >1.00E+5nM
In DepthDetails PCBioAssay
TargetSentrin-specific protease 8(Homo sapiens (Human))
Burnham Center For Chemical Genomics
Curated by PubChem BioAssay
LigandPNGBDBM82702((4E)-4-[[(2,4-dinitrophenyl)hydrazo]methylidene]-5...)
Affinity DataIC50: >1.00E+5nM
In DepthDetails PCBioAssay
TargetCorticotropin-releasing factor-binding protein(Homo sapiens (Human))
Burnham Center For Chemical Genomics
Curated by PubChem BioAssay
LigandPNGBDBM82702((4E)-4-[[(2,4-dinitrophenyl)hydrazo]methylidene]-5...)
Affinity DataIC50:  1.55E+4nM
In DepthDetails PCBioAssay