BDBM82801 7-methoxy-1,1,2,2,4-pentamethyl-quinolin-1-ium;iodide::7-methoxy-1,1,2,2,4-pentamethylquinolin-1-ium;iodide::MLS000709959::SMR000287126::cid_16192935
SMILES COc1ccc2C(C)=CC(C)(C)[N+](C)(C)c2c1
InChI Key InChIKey=TYXFHPUNCQHTBF-UHFFFAOYSA-N
Data  1 IC50
  Tab Delimited (TSV)   2D SDfile   Computed 3D by Vconf -m prep SDfile
Find this compound or compounds like it in BindingDB:
Activity Spreadsheet -- Enzyme Inhibition Constant Data from BindingDB
Found 1 hit for monomerid = 82801
TargetCarboxy-terminal domain RNA polymerase II polypeptide A small phosphatase 1(Homo sapiens (Human))
Burnham Center For Chemical Genomics
Curated by PubChem BioAssay
LigandPNGBDBM82801(7-methoxy-1,1,2,2,4-pentamethyl-quinolin-1-ium;iod...)
Affinity DataIC50:  3.14E+3nM. Assay description: Data Source: Sanford-Burnham Center for Chemical Genomics (SBCCG) Source Affiliation: Sanford-Burnham Medical Research Institute (SBMRI, San Diego, C...
In DepthDetails PCBioAssay