BDBM8282 3-[methyl(phenyl)amino]-4-phenyl-2,5-dihydro-1H-pyrrole-2,5-dione::4-arylmaleimide deriv. 7a
SMILES CN(C1=C(C(=O)NC1=O)c1ccccc1)c1ccccc1
InChI Key InChIKey=RYLUURFDWDEDKU-UHFFFAOYSA-N
Data  2 IC50
  Tab Delimited (TSV)   2D SDfile   Computed 3D by Vconf -m prep SDfile
Find this compound or compounds like it in BindingDB:
Activity Spreadsheet -- Enzyme Inhibition Constant Data from BindingDB
Found 2 hits for monomerid = 8282
TargetGlycogen synthase kinase-3 beta(Homo sapiens (Human))
University Of Jordan
Curated by ChEMBL
LigandPNGBDBM8282(3-[methyl(phenyl)amino]-4-phenyl-2,5-dihydro-1H-py...)
Affinity DataIC50:  2.61E+3nM. Assay description: Inhibition of recombinant GSK3-beta
In DepthDetails ArticlePubMed
TargetGlycogen synthase kinase-3 alpha(Homo sapiens (Human))
Smithkline Beecham Pharmaceuticals
LigandPNGBDBM8282(3-[methyl(phenyl)amino]-4-phenyl-2,5-dihydro-1H-py...)
Affinity DataIC50:  2.61E+3nMpH: 7.0 T: 2°C. Assay description: The biochemical activity of compounds was determined by incubation with specific enzyme and substrate in the presence 10 uM ATP/ [gamma-33P] ATP. Aft...
In DepthDetails ArticlePubMed