BDBM8293 1-methyl-3-phenyl-4-(phenylamino)-2,5-dihydro-1H-pyrrole-2,5-dione::4-arylmaleimide deriv. 9a::JMC485419 Compound 12
SMILES CN1C(=O)C(Nc2ccccc2)=C(C1=O)c1ccccc1
InChI Key InChIKey=VHMAXOKYWIMGCU-UHFFFAOYSA-N
Data  1 IC50  2 EC50
  Tab Delimited (TSV)   2D SDfile   Computed 3D by Vconf -m prep SDfile
Find this compound or compounds like it in BindingDB:
Activity Spreadsheet -- Enzyme Inhibition Constant Data from BindingDB
Found 3 hits for monomerid = 8293
TargetGlycogen synthase kinase-3 alpha(Homo sapiens (Human))
Smithkline Beecham Pharmaceuticals
LigandPNGBDBM8293(1-methyl-3-phenyl-4-(phenylamino)-2,5-dihydro-1H-p...)
Affinity DataIC50: >5.00E+3nMpH: 7.0 T: 2°C. Assay description: The biochemical activity of compounds was determined by incubation with specific enzyme and substrate in the presence 10 uM ATP/ [gamma-33P] ATP. Aft...
In DepthDetails ArticlePubMed
TargetOxysterols receptor LXR-beta(Homo sapiens (Human))
Glaxosmithkline
LigandPNGBDBM8293(1-methyl-3-phenyl-4-(phenylamino)-2,5-dihydro-1H-p...)
Affinity DataEC50:  850nMpH: 7.5 T: 2°C. Assay description: The LXR LiSA measures the ligand-dependent recruitment of a 25 amino acid fragment of the steroid receptor coactivator 1 (SRC1) to the ligand-binding...
In DepthDetails ArticlePubMed
TargetOxysterols receptor LXR-alpha(Homo sapiens (Human))
Glaxosmithkline
LigandPNGBDBM8293(1-methyl-3-phenyl-4-(phenylamino)-2,5-dihydro-1H-p...)
Affinity DataEC50:  1.59E+3nMpH: 7.5 T: 2°C. Assay description: The LXR LiSA measures the ligand-dependent recruitment of a 25 amino acid fragment of the steroid receptor coactivator 1 (SRC1) to the ligand-binding...
In DepthDetails ArticlePubMed