BDBM82998 3-[1,4-dimethyl-2,3-bis(oxidanylidene)quinoxalin-6-yl]sulfonyl-N-(4-ethanoylphenyl)propanamide::MLS001110157::N-(4-acetylphenyl)-3-(1,4-dimethyl-2,3-dioxoquinoxalin-6-yl)sulfonylpropanamide::N-(4-acetylphenyl)-3-(2,3-diketo-1,4-dimethyl-quinoxalin-6-yl)sulfonyl-propionamide::N-(4-acetylphenyl)-3-[(1,4-dimethyl-2,3-dioxo-6-quinoxalinyl)sulfonyl]propanamide::SMR000625334::cid_23603045
SMILES CC(=O)c1ccc(NC(=O)CCS(=O)(=O)c2ccc3n(C)c(=O)c(=O)n(C)c3c2)cc1
InChI Key InChIKey=KGKQBKWBPRVDCS-UHFFFAOYSA-N
Data  1 IC50
  Tab Delimited (TSV)   2D SDfile   Computed 3D by Vconf -m prep SDfile
Find this compound or compounds like it in BindingDB:
Activity Spreadsheet -- Enzyme Inhibition Constant Data from BindingDB
Found 1 hit for monomerid = 82998
TargetCarboxy-terminal domain RNA polymerase II polypeptide A small phosphatase 1(Homo sapiens (Human))
Burnham Center For Chemical Genomics
Curated by PubChem BioAssay
LigandPNGBDBM82998(3-[1,4-dimethyl-2,3-bis(oxidanylidene)quinoxalin-6...)
Affinity DataIC50: >8.00E+4nM. Assay description: Data Source: Sanford-Burnham Center for Chemical Genomics (SBCCG) Source Affiliation: Sanford-Burnham Medical Research Institute (SBMRI, San Diego, C...
In DepthDetails PCBioAssay