BDBM83184 (3Z)-3-(2-furanylmethylidene)-1,2-dihydrocyclopenta[b]quinoline-9-carboxylic acid [2-(cyclopentylamino)-2-oxoethyl] ester::(3Z)-3-(2-furfurylidene)-1,2-dihydrocyclopenta[b]quinoline-9-carboxylic acid [2-(cyclopentylamino)-2-keto-ethyl] ester::MLS002635225::SMR001544529::[2-(cyclopentylamino)-2-oxidanylidene-ethyl] (3Z)-3-(furan-2-ylmethylidene)-1,2-dihydrocyclopenta[b]quinoline-9-carboxylate::[2-(cyclopentylamino)-2-oxoethyl] (3Z)-3-(furan-2-ylmethylidene)-1,2-dihydrocyclopenta[b]quinoline-9-carboxylate::cid_44825350
SMILES O=C(COC(=O)c1c2CC\C(=C\c3ccco3)c2nc2ccccc12)NC1CCCC1
InChI Key InChIKey=HJLVADIYJRSVIR-PEZBUJJGSA-N
Data  4 IC50
  Tab Delimited (TSV)   2D SDfile   Computed 3D by Vconf -m prep SDfile
Find this compound or compounds like it in BindingDB:
Activity Spreadsheet -- Enzyme Inhibition Constant Data from BindingDB
Found 4 hits for monomerid = 83184
TargetCarboxy-terminal domain RNA polymerase II polypeptide A small phosphatase 1(Homo sapiens (Human))
Burnham Center For Chemical Genomics
Curated by PubChem BioAssay
LigandPNGBDBM83184((3Z)-3-(2-furanylmethylidene)-1,2-dihydrocyclopent...)
Affinity DataIC50:  2.49E+3nM. Assay description: Data Source: Sanford-Burnham Center for Chemical Genomics (SBCCG) Source Affiliation: Sanford-Burnham Medical Research Institute (SBMRI, San Diego, C...
In DepthDetails PCBioAssay
TargetPC4 and SFRS1-interacting protein(Homo sapiens (Human))
The Scripps Research Institute Molecular Screening Center
Curated by PubChem BioAssay
LigandPNGBDBM83184((3Z)-3-(2-furanylmethylidene)-1,2-dihydrocyclopent...)
Affinity DataIC50:  6.44E+3nM. Assay description: Source (MLPCN Center Name): The Scripps Research Institute Molecular Screening Center (SRIMSC) Affiliation: Ohio State University Assay Provider: Mam...
In DepthDetails PCBioAssay
TargetPC4 and SFRS1-interacting protein(Homo sapiens (Human))
The Scripps Research Institute Molecular Screening Center
Curated by PubChem BioAssay
LigandPNGBDBM83184((3Z)-3-(2-furanylmethylidene)-1,2-dihydrocyclopent...)
Affinity DataIC50:  2.61E+4nM. Assay description: Source (MLPCN Center Name): The Scripps Research Institute Molecular Screening Center (SRIMSC) Affiliation: Ohio State University Assay Provider: Mam...
In DepthDetails PCBioAssay
TargetProbable nicotinate-nucleotide adenylyltransferase(Staphylococcus aureus subsp. aureus N315)
Burnham Center For Chemical Genomics
Curated by PubChem BioAssay
LigandPNGBDBM83184((3Z)-3-(2-furanylmethylidene)-1,2-dihydrocyclopent...)
Affinity DataIC50:  1.69E+4nM
In DepthDetails PCBioAssay